Target
Oxysterols receptor LXR-beta [154-461]
Ligand
BDBM26070
Substrate
BDBM19993
Meas. Tech.
LXR Binding Assay and hLXR Reporter Assay
pH
7.4±n/a
Temperature
277.15±n/a K
IC50
58±n/a nM
EC50
9050±n/a nM
Comments
74% efficacy.
Citation
 Wrobel, JSteffan†, RBowen, SMMagolda, RMatelan†, EUnwalla†, RBasso, MClerin, VGardell, SJNambi, PQuinet, EReminick, JIVlasuk, GPWang, SFeingold, IHuselton, CBonn, T Indazole-Based Liver X Receptor (LXR) Modulators with Maintained Atherosclerotic Lesion Reduction Activity but Diminished Stimulation of Hepatic Triglyceride Synthesis J Med Chem 51:7161-8 (2008)  
Target
Name:
Oxysterols receptor LXR-beta [154-461]
Synonyms:
LXRB NER NR1H2_HUMAN Nuclear receptor NER Oxysterols receptor LXR-beta Ubiquitously-expressed nuclear receptor
Type:
Receptor
Mol. Mass.:
34695.52
Organism:
Homo sapiens (Human)
Description:
LXR beta ligand binding domain (amino acid residues 154-461) with an N-terminal biotinylation tag expressed in E.coli, was used for the binding assays.
Residue:
308
  
Inhibitor
Name:
BDBM26070
Synonyms:
2-[(4-chlorophenyl)methyl]-3-(4-fluorophenyl)-7-(trifluoromethyl)-2H-indazole | 2-benzyl-3-aryl-7-trifluoromethylindazole, 16
Type:
Small organic molecule
Emp. Form.:
C21H13ClF4N2
Mol. Mass.:
404.788
SMILES:
Fc1ccc(cc1)-c1n(Cc2ccc(Cl)cc2)nc2c(cccc12)C(F)(F)F
:
Substrate
Name:
BDBM19993
Synonyms:
CHEMBL62136 T 0901317 TO-901317 US10669296, Compound TO901317 [3H]T0901317
Type:
Small organic molecule
Emp. Form.:
C17H12F9NO3S
Mol. Mass.:
481.333
SMILES:
OC(c1ccc(cc1)N(CC(F)(F)F)S(=O)(=O)c1ccccc1)(C(F)(F)F)C(F)(F)F
: