Target
Oxysterols receptor LXR-alpha [197-447]
Ligand
BDBM26073
Substrate
BDBM19993
Meas. Tech.
LXR Binding Assay and hLXR Reporter Assay
IC50
379±n/a nM
EC50
15210±n/a nM
Citation
 Wrobel, JSteffan†, RBowen, SMMagolda, RMatelan†, EUnwalla†, RBasso, MClerin, VGardell, SJNambi, PQuinet, EReminick, JIVlasuk, GPWang, SFeingold, IHuselton, CBonn, T Indazole-Based Liver X Receptor (LXR) Modulators with Maintained Atherosclerotic Lesion Reduction Activity but Diminished Stimulation of Hepatic Triglyceride Synthesis J Med Chem 51:7161-8 (2008)  
Target
Name:
Oxysterols receptor LXR-alpha [197-447]
Synonyms:
LXRA NR1H3 Nuclear orphan receptor LXR-alpha Oxysterols receptor LXR-alpha
Type:
Receptor
Mol. Mass.:
28986.41
Organism:
Homo sapiens (Human)
Description:
LXR alpha ligand binding domain (amino acid residues 197-447) with an N-terminal biotinylation tag expressed in E.coli, was used for the binding assays.
Residue:
251
  
Inhibitor
Name:
BDBM26073
Synonyms:
2-benzyl-3-aryl-7-trifluoromethylindazole, 19 | 3-(4-chlorophenyl)-2-[(2-chlorophenyl)methyl]-7-(trifluoromethyl)-2H-indazole
Type:
Small organic molecule
Emp. Form.:
C21H13Cl2F3N2
Mol. Mass.:
421.243
SMILES:
FC(F)(F)c1cccc2c(-c3ccc(Cl)cc3)n(Cc3ccccc3Cl)nc12
:
Substrate
Name:
BDBM19993
Synonyms:
CHEMBL62136 T 0901317 TO-901317 US10669296, Compound TO901317 [3H]T0901317
Type:
Small organic molecule
Emp. Form.:
C17H12F9NO3S
Mol. Mass.:
481.333
SMILES:
OC(c1ccc(cc1)N(CC(F)(F)F)S(=O)(=O)c1ccccc1)(C(F)(F)F)C(F)(F)F
: