Target
Carbonic anhydrase 1
Ligand
BDBM26197
Substrate
BDBM10856
Meas. Tech.
CA Inhibition Assay
pH
7.4±n/a
Temperature
298.15±n/a K
Ki
10000±n/a nM
Citation
 Innocenti, AVullo, DScozzafava, ASupuran, CT Carbonic anhydrase inhibitors: inhibition of mammalian isoforms I-XIV with a series of substituted phenols including paracetamol and salicylic acid. Bioorg Med Chem 16:7424-8 (2008)  
Target
Name:
Carbonic anhydrase 1
Synonyms:
CA-I CAB Carbonate dehydratase I Carbonic anhydrase 1 (CA I) Carbonic anhydrase 1 (Recombinant CA I) Carbonic anhydrase B Carbonic anhydrase I (CA I) Carbonic anhydrase I (CAI) Carbonic anhydrase isoenzyme I (hCA I) | hCA
Type:
Enzyme
Mol. Mass.:
28873.37
Organism:
Homo sapiens (Human)
Description:
P00915
Residue:
261
  
Inhibitor
Name:
BDBM26197
Synonyms:
CHEMBL112 Norco US9333197, Acetaminophen phenol derivative, 11
Type:
Small organic molecule
Emp. Form.:
C8H9NO2
Mol. Mass.:
151.1626
SMILES:
CC(=O)Nc1ccc(O)cc1
:
Substrate
Name:
BDBM10856
Synonyms:
Carbon Dioxide | methanedione
Type:
Small organic molecule
Emp. Form.:
CO2
Mol. Mass.:
44.0095
SMILES:
O=C=O
: