Target
5-hydroxytryptamine receptor 7
Ligand
BDBM352214
Substrate
Meas. Tech.
Radiolabel Binding Studies for Serotonin 5-HT7 Receptors, Method 2
IC50
13.0±n/a nM
Citation
 Canney, DJBlass, BEGao, RAbou-Gharbia, M 5-hydroxytryptamine receptor 7 activity modulators and their method of use US Patent  US10287274 Publication Date 5/14/2019
Target
Name:
5-hydroxytryptamine receptor 7
Synonyms:
5-HT-7 5-HT7 5-HT7S 5HT7 HTR7 | Serotonin receptor 7
Type:
G Protein-Coupled Receptor (GPCR)
Mol. Mass.:
53573.08
Organism:
Homo sapiens (Human)
Description:
P34969
Residue:
479
  
Inhibitor
Name:
BDBM352214
Synonyms:
US10239868, Entry 18 US10676464, Entry 18 | US9802924, Entry 18
Type:
Small organic molecule
Emp. Form.:
C19H27NO2
Mol. Mass.:
301.4232
SMILES:
CCC1(CC)CC(CCN2CCc3ccccc3C2)OC1=O
: