Target
Gamma-aminobutyric acid receptor subunit alpha-3 [29-492]/beta-2 [26-512]/gamma-2 [40-467]
Ligand
BDBM26263
Substrate
BDBM26263
Meas. Tech.
Radioligand Binding Assay
pH
7.4±n/a
Temperature
295.15±n/a K
Ki
8.1±0.1 nM
Citation
 Hanson, SMMorlock, EVSatyshur, KACzajkowski, C Structural Requirements for Eszopiclone and Zolpidem Binding to the gamma-Aminobutyric Acid Type-A (GABAA) Receptor Are Different. J Med Chem 51:7243-52 (2008)  
Target
Name:
Gamma-aminobutyric acid receptor subunit alpha-3 [29-492]/beta-2 [26-512]/gamma-2 [40-467]
Synonyms:
GABAA Receptor, alpha-3, beta-2, gamma-2
Type:
Protein Complex
Mol. Mass.:
Description:
Components:
This complex has 3 components.
Component 1
Name:
Gamma-aminobutyric acid receptor subunit gamma-2 [40-467]
Synonyms:
GABA(A) receptor subunit gamma-2 GABRG2 Gamma-aminobutyric acid receptor subunit gamma-2
Type:
Ionic channel
Mol. Mass.:
49862.76
Organism:
Homo sapiens (Human)
Description:
P18507[40-467]
Residue:
428
  
Component 2
Name:
Gamma-aminobutyric acid receptor subunit beta-2 [26-512]
Synonyms:
GABA(A) receptor subunit beta-2 GABRB2 Gamma-aminobutyric acid receptor subunit beta-2
Type:
Ionic channel
Mol. Mass.:
56212.32
Organism:
Homo sapiens (Human)
Description:
P47870[26-512]
Residue:
487
  
Component 3
Name:
Gamma-aminobutyric acid receptor subunit alpha-3 [29-492]
Synonyms:
GABA(A) receptor subunit alpha-3 GABRA3 Gamma-aminobutyric acid receptor subunit alpha-3
Type:
Ionic channel
Mol. Mass.:
52153.35
Organism:
Homo sapiens (Human)
Description:
P34903[29-492]
Residue:
464
  
Inhibitor
Name:
BDBM26263
Synonyms:
Anexate FLUMAZENIL Romazicon ethyl 12-fluoro-8-methyl-9-oxo-2,4,8-triazatricyclo[8.4.0.0^{2,6}]tetradeca-1(14),3,5,10,12-pentaene-5-carboxylate
Type:
Small organic molecule
Emp. Form.:
C15H14FN3O3
Mol. Mass.:
303.2884
SMILES:
CCOC(=O)c1ncn-2c1CN(C)C(=O)c1cc(F)ccc-21
:
Substrate
Name:
BDBM26263
Synonyms:
Anexate FLUMAZENIL Romazicon ethyl 12-fluoro-8-methyl-9-oxo-2,4,8-triazatricyclo[8.4.0.0^{2,6}]tetradeca-1(14),3,5,10,12-pentaene-5-carboxylate
Type:
Small organic molecule
Emp. Form.:
C15H14FN3O3
Mol. Mass.:
303.2884
SMILES:
CCOC(=O)c1ncn-2c1CN(C)C(=O)c1cc(F)ccc-21
: