Target
KiSS-1 receptor
Ligand
BDBM26348
Substrate
[125I]Kisspeptin-15
Meas. Tech.
Receptor Binding Assay
pH
7.3±n/a
Temperature
298.15±n/a K
IC50
240±n/a nM
Citation
 Tomita, KOishi, SOhno, HPeiper, SCFujii, N Development of Novel G-Protein-Coupled Receptor 54 Agonists with Resistance to Degradation by Matrix Metalloproteinase. J Med Chem 51:7645-9 (2008)  
Target
Name:
KiSS-1 receptor
Synonyms:
AXOR12 G-protein coupled receptor 54 (GPR54) Hypogonadotropin-1 KISSR_HUMAN Kisspeptins receptor hOT7T175
Type:
G Protein-Coupled Receptor (GPCR)
Mol. Mass.:
42613.79
Organism:
Homo sapiens (Human)
Description:
Binding assay was performed using membranes from the CHO cell transfectants.
Residue:
398
  
Inhibitor
Name:
BDBM26348
Synonyms:
(2R)-N-[(1S)-4-carbamimidamido-1-{[(1S)-1-carbamoyl-2-(1H-indol-3-yl)ethyl]carbamoyl}butyl]-2-{2-[(2S)-2-[(4-fluorophenyl)formamido]-3-phenylpropanamido]acetamido}-4-methylpentanamide | Peptide analogue, 26
Type:
Emp. Form.:
C41H51FN10O6
Mol. Mass.:
798.9054
SMILES:
CC(C)C[C@@H](NC(=O)CNC(=O)[C@H](Cc1ccccc1)NC(=O)c1ccc(F)cc1)C(=O)N[C@@H](CCCN=C(N)N)C(=O)N[C@@H](Cc1c[nH]c2ccccc12)C(N)=O
:
Substrate
Name:
[125I]Kisspeptin-15
Synonyms:
Type:
radiolabeled peptide
Mol. Mass.:
1872.07
Organism:
Description:
Residue:
15
KDLPNYNWNSFGLRF