Target
Indoleamine 2,3-dioxygenase 1
Ligand
BDBM387581
Substrate
Meas. Tech.
In-vitro IDO1 Enzyme (Indoleamine 2,3-dioxygenase) Assay
IC50
<200±n/a nM
Citation
 Banerjee, MMiddya, SShrivastava, RRaina, SSurya, AYadav, DBYadav, VKKapoor, KKVenkatesan, ASmith, RAThompson, SK Inhibitors of the kynurenine pathway US Patent  US10294212 Publication Date 5/21/2019 
Target
Name:
Indoleamine 2,3-dioxygenase 1
Synonyms:
I23O1_HUMAN IDO-1 INDO Indoleamine 2,3-dioxygenase | Indoleamine-pyrrole 2,3-dioxygenase
Type:
Enzyme
Mol. Mass.:
45330.80
Organism:
Homo sapiens (Human)
Description:
P14902
Residue:
403
  
Inhibitor
Name:
BDBM387581
Synonyms:
N3-(3-chloro-4- fluorophenyl)- 7-(4- fluorophenyl)- 5-methoxy- furo[2,3-c] pyridine- 2,3-diamine | US10294212, No. 174
Type:
Small organic molecule
Emp. Form.:
C20H14ClF2N3O2
Mol. Mass.:
401.794
SMILES:
COc1cc2c(Nc3ccc(F)c(Cl)c3)c(N)oc2c(n1)-c1ccc(F)cc1
: