Target
Indoleamine 2,3-dioxygenase 1
Ligand
BDBM387630
Substrate
Meas. Tech.
In-vitro IDO1 Enzyme (Indoleamine 2,3-dioxygenase) Assay
IC50
<200±n/a nM
Citation
 Banerjee, MMiddya, SShrivastava, RRaina, SSurya, AYadav, DBYadav, VKKapoor, KKVenkatesan, ASmith, RAThompson, SK Inhibitors of the kynurenine pathway US Patent  US10294212 Publication Date 5/21/2019 
Target
Name:
Indoleamine 2,3-dioxygenase 1
Synonyms:
I23O1_HUMAN IDO-1 INDO Indoleamine 2,3-dioxygenase | Indoleamine-pyrrole 2,3-dioxygenase
Type:
Enzyme
Mol. Mass.:
45330.80
Organism:
Homo sapiens (Human)
Description:
P14902
Residue:
403
  
Inhibitor
Name:
BDBM387630
Synonyms:
N3-(3-Chloro-4- fluorophenyl)- 7-(pyridin-4- yl)benzo[b] thiophene-2,3- diamine | US10294212, No. 213
Type:
Small organic molecule
Emp. Form.:
C19H13ClFN3S
Mol. Mass.:
369.843
SMILES:
Nc1sc2c(cccc2c1Nc1ccc(F)c(Cl)c1)-c1ccncc1
: