Target
Serine/threonine-protein kinase pim-1
Ligand
BDBM26655
Substrate
GST-BAD
Meas. Tech.
Solid-Phase ELISA Kinase Assay
pH
7±n/a
Temperature
303.15±n/a K
IC50
430±n/a nM
Citation
 Holder, SZemskova, MZhang, CTabrizizad, MBremer, RNeidigh, JWLilly, MB Characterization of a potent and selective small-molecule inhibitor of the PIM1 kinase. Mol Cancer Ther 6:163-72 (2007)  
Target
Name:
Serine/threonine-protein kinase pim-1
Synonyms:
PIM-1 Kinase PIM1_HUMAN Serine/threonine-protein kinase (PIM1) Serine/threonine-protein kinase PIM1 | Serine/threonine-protein kinase pim-1 (PIM1)
Type:
Protein
Mol. Mass.:
35681.82
Organism:
Homo sapiens (Human)
Description:
P11309
Residue:
313
  
Inhibitor
Name:
BDBM26655
Synonyms:
2-(3,4-dihydroxyphenyl)-3,5,7,8-tetrahydroxy-4H-chromen-4-one Gossypetin (23) | gossypetin
Type:
Flavonoid
Emp. Form.:
C15H10O8
Mol. Mass.:
318.2351
SMILES:
Oc1ccc(cc1O)-c1oc2c(O)c(O)cc(O)c2c(=O)c1O
:
Substrate
Name:
Bcl2-associated agonist of cell death
Synonyms:
BAD_MOUSE Bbc6 GST-BAD
Type:
Other Protein Type
Mol. Mass.:
22084.58
Organism:
Mus musculus (mouse)
Description:
Residue:
204