Target
Carbonic anhydrase 4
Ligand
BDBM26980
Substrate
BDBM10856
Meas. Tech.
CA Inhibition Assay
Ki
90000±n/a nM
Citation
 Innocenti, AHilvo, MParkkila, SScozzafava, ASupuran, CT Carbonic anhydrase inhibitors: the membrane-associated isoform XV is highly inhibited by inorganic anions. Bioorg Med Chem Lett 19:1155-8 (2009)  
Target
Name:
Carbonic anhydrase 4
Synonyms:
CA-IV CAH4_HUMAN Carbonic anhydrase Carbonic anhydrase IV (CA IV)
Type:
Enzyme
Mol. Mass.:
35037.98
Organism:
Homo sapiens (Human)
Description:
P22748
Residue:
312
  
Inhibitor
Name:
BDBM26980
Synonyms:
Br- CHEMBL1644694 bromide ion
Type:
Ion
Emp. Form.:
Br
Mol. Mass.:
79.905
SMILES:
[Br-]
:
Substrate
Name:
BDBM10856
Synonyms:
Carbon Dioxide | methanedione
Type:
Small organic molecule
Emp. Form.:
CO2
Mol. Mass.:
44.0095
SMILES:
O=C=O
: