Target
Carbonic anhydrase 15 [19-324]
Ligand
BDBM26991
Substrate
BDBM10856
Meas. Tech.
CA Inhibition Assay
Ki
9700±n/a nM
Citation
 Innocenti, AHilvo, MParkkila, SScozzafava, ASupuran, CT Carbonic anhydrase inhibitors: the membrane-associated isoform XV is highly inhibited by inorganic anions. Bioorg Med Chem Lett 19:1155-8 (2009)  
Target
Name:
Carbonic anhydrase 15 [19-324]
Synonyms:
CA-XV Ca15 Carbonate dehydratase XV | Carbonic Anhydrase XV
Type:
Enzyme
Mol. Mass.:
33409.51
Organism:
Mus musculus (mouse)
Description:
Mouse cloned isozyme.
Residue:
306
  
Inhibitor
Name:
BDBM26991
Synonyms:
CHEMBL1689285 bisulfite | hydrogen sulfite
Type:
Ion
Emp. Form.:
HO3S
Mol. Mass.:
81.072
SMILES:
OS([O-])=O
:
Substrate
Name:
BDBM10856
Synonyms:
Carbon Dioxide | methanedione
Type:
Small organic molecule
Emp. Form.:
CO2
Mol. Mass.:
44.0095
SMILES:
O=C=O
: