Target
Oxysterols receptor LXR-beta
Ligand
BDBM27252
Substrate
biotinylated SRC-1 peptide
Meas. Tech.
HTRF Cofactor Peptide Recruitment Assay
pH
7.5±n/a
Temperature
295.15±n/a K
EC50
420±n/a nM
Citation
 Kher, SLake, KSircar, IPannala, MBakir, FZapf, JXu, KZhang, SHLiu, JMorera, LSakurai, NJack, RCheng, JF 2-Aryl-N-acyl indole derivatives as liver X receptor (LXR) agonists. Bioorg Med Chem Lett 17:4442-6 (2007)  
Target
Name:
Oxysterols receptor LXR-beta
Synonyms:
LXRB Liver X, LXR beta NR1H2 Nuclear receptor NER Ubiquitously-expressed nuclear receptor
Type:
Enzyme Catalytic Domain
Mol. Mass.:
50978.79
Organism:
Homo sapiens (Human)
Description:
P55055
Residue:
460
  
Inhibitor
Name:
BDBM27252
Synonyms:
Boc-indole derivative, 10 | tert-butyl 2-[3-(2-benzenesulfonamidoethyl)phenyl]-1H-indole-1-carboxylate
Type:
Small organic molecule
Emp. Form.:
C27H28N2O4S
Mol. Mass.:
476.587
SMILES:
CC(C)(C)OC(=O)n1c(cc2ccccc12)-c1cccc(CCNS(=O)(=O)c2ccccc2)c1
:
Substrate
Name:
biotinylated SRC-1 peptide
Synonyms:
Type:
Peptide
Mol. Mass.:
3157.52
Organism:
Description:
A biotinylated peptide comprises amino acids 675-699 of steroid receptor coactivator 1 (SRC1).
Residue:
28