Target
Glycogen synthase kinase-3 beta
Ligand
BDBM293453
Substrate
Meas. Tech.
Kinase Assay
EC50
3967±n/a nM
Citation
 KC, SKMak, CCEastman, BWCao, JBollu, VMittapalli, GKChiruta, C Isoquinolin-3-yl carboxamides and preparation and use thereof US Patent  US9951048 Publication Date 4/24/2018 
Target
Name:
Glycogen synthase kinase-3 beta
Synonyms:
GSK-3 beta GSK3B Glycogen synthase kinase 3 beta (GSK3B) Glycogen synthase kinase-3 beta (GSK-3B) Glycogen synthase kinase-3 beta (GSK3B) Glycogen synthase kinase-3beta (GSK3B) | Serine/threonine-protein kinase GSK3B
Type:
Enzyme
Mol. Mass.:
46756.38
Organism:
Homo sapiens (Human)
Description:
P49841
Residue:
420
  
Inhibitor
Name:
BDBM293453
Synonyms:
US10106527, Compound 56 US11548872, Compound 56 US9951048, Compound 56
Type:
Small organic molecule
Emp. Form.:
C27H30N6O2
Mol. Mass.:
470.5661
SMILES:
CC(C)N1CCC(CC1)Oc1cc(ccn1)C(=O)Nc1cc2cc(ccc2cn1)-c1cnn(C)c1
: