Target
Gag-Pol polyprotein [588-1127,L687I]/[588-1147,L687I]
Ligand
BDBM1434
Substrate
poly(rA)/oligo(dT)
Meas. Tech.
Reverse Transcriptase Assay
pH
7.5±n/a
Temperature
310.15±n/a K
Ki
9000±1000 nM
Citation
 Butini, SBrindisi, MCosconati, SMarinelli, LBorrelli, GCoccone, SSRamunno, ACampiani, GNovellino, EZanoli, SSamuele, AGiorgi, GBergamini, AMattia, MDLalli, SGalletti, BGemma, SMaga, G Specific Targeting of Highly Conserved Residues in the HIV-1 Reverse Transcriptase Primer Grip Region. 2. Stereoselective Interaction to Overcome the Effects of Drug Resistant Mutations. J Med Chem 52:1224-8 (2009)  
Target
Name:
Gag-Pol polyprotein [588-1127,L687I]/[588-1147,L687I]
Synonyms:
EC: 2.7.7.49 | HIV-1 Reverse Transcriptase Mutant (L100I)
Type:
Protein Complex
Mol. Mass.:
Description:
Components:
This complex has 2 components.
Component 1
Name:
Gag-Pol polyprotein [588-1147,L687I]
Synonyms:
HIV-1 Reverse Transcriptase Mutant (L100I) Chain A gag-pol
Type:
Enzyme Subunit
Mol. Mass.:
64486.41
Organism:
Human immunodeficiency virus type 1
Description:
P04585[588-1147,L687I]
Residue:
560
  
Component 2
Name:
Gag-Pol polyprotein [588-1127,L687I]
Synonyms:
HIV-1 Reverse Transcriptase Mutant (L100I) Chain B gag-pol
Type:
Enzyme Subunit
Mol. Mass.:
51337.13
Organism:
Human immunodeficiency virus type 1
Description:
P04585[588-1127,L687I]
Residue:
440
  
Inhibitor
Name:
BDBM1434
Synonyms:
11-cyclopropyl-5,11-dihydro-4-methyl-6H-dipyrido[3,2-b:2 ,3 -e][1,4]diazepin-6-one BI-RG-587 Nevirapine US11420959, Example NVP | Viramune
Type:
Small organic molecule
Emp. Form.:
C15H14N4O
Mol. Mass.:
266.2979
SMILES:
Cc1ccnc2N(C3CC3)c3ncccc3C(=O)Nc12
:
Substrate
Name:
poly(rA)/oligo(dT)
Synonyms:
Type:
RNA/DNA duplex
Mol. Mass.:
358.43
Organism:
Description:
[3H]-dTTP is co-substrate.
Residue:
3
NA