Target
Gag-Pol polyprotein [588-1027,Y769I]/[588-1147,Y769I]
Ligand
BDBM27580
Substrate
poly(rA)/oligo(dT)
Meas. Tech.
Reverse Transcriptase Assay
pH
7.5±n/a
Temperature
310.15±n/a K
Ki
<10000±n/a nM
Citation
 Butini, SBrindisi, MCosconati, SMarinelli, LBorrelli, GCoccone, SSRamunno, ACampiani, GNovellino, EZanoli, SSamuele, AGiorgi, GBergamini, AMattia, MDLalli, SGalletti, BGemma, SMaga, G Specific Targeting of Highly Conserved Residues in the HIV-1 Reverse Transcriptase Primer Grip Region. 2. Stereoselective Interaction to Overcome the Effects of Drug Resistant Mutations. J Med Chem 52:1224-8 (2009)  
Target
Name:
Gag-Pol polyprotein [588-1027,Y769I]/[588-1147,Y769I]
Synonyms:
HIV-1 Reverse Transcriptase Mutant (Y181I)
Type:
Protein Complex
Mol. Mass.:
Description:
Components:
This complex has 2 components.
Component 1
Name:
Gag-Pol polyprotein [588-1147,Y769I]
Synonyms:
HIV-1 Reverse Transcriptase Mutant (Y181I) Chain A gag-pol
Type:
Enzyme Subunit
Mol. Mass.:
64436.39
Organism:
Human immunodeficiency virus type 1
Description:
P04585[588-1147,Y769I]
Residue:
560
  
Component 2
Name:
Gag-Pol polyprotein [588-1027,Y769I]
Synonyms:
HIV-1 Reverse Transcriptase Mutant (Y181I) Chain B gag-pol
Type:
Enzyme Subunit
Mol. Mass.:
51287.11
Organism:
Human immunodeficiency virus type 1
Description:
P04585[588-1027,Y769I]
Residue:
440
  
Inhibitor
Name:
BDBM27580
Synonyms:
8-[4-(3-chlorophenoxymethyl)phenyl]-8-ethyl-9-oxa-2-azatricyclo[8.4.0.0^{2,6}]tetradeca-1(14),3,5,10,12-pentaen-7-one | Pyrrolobenzoxazepinone (PBO), 5
Type:
Small organic molecule
Emp. Form.:
C27H22ClNO3
Mol. Mass.:
443.921
SMILES:
CCC1(Oc2ccccc2-n2cccc2C1=O)c1ccc(COc2cccc(Cl)c2)cc1
:
Substrate
Name:
poly(rA)/oligo(dT)
Synonyms:
Type:
RNA/DNA duplex
Mol. Mass.:
358.43
Organism:
Description:
[3H]-dTTP is co-substrate.
Residue:
3
NA