Target
Gag-Pol polyprotein [588-1027,Y776L]/[588-1147,Y776L]
Ligand
BDBM2483
Substrate
poly(rA)/oligo(dT)
Meas. Tech.
Reverse Transcriptase Assay
Ki
380±n/a nM
Citation
 Butini, SBrindisi, MCosconati, SMarinelli, LBorrelli, GCoccone, SSRamunno, ACampiani, GNovellino, EZanoli, SSamuele, AGiorgi, GBergamini, AMattia, MDLalli, SGalletti, BGemma, SMaga, G Specific Targeting of Highly Conserved Residues in the HIV-1 Reverse Transcriptase Primer Grip Region. 2. Stereoselective Interaction to Overcome the Effects of Drug Resistant Mutations. J Med Chem 52:1224-8 (2009)  
Target
Name:
Gag-Pol polyprotein [588-1027,Y776L]/[588-1147,Y776L]
Synonyms:
HIV-1 Reverse Transcriptase Mutant (Y188L)
Type:
Protein Complex
Mol. Mass.:
Description:
Components:
This complex has 2 components.
Component 1
Name:
Gag-Pol polyprotein [588-1147,Y776L]
Synonyms:
HIV-1 Reverse Transcriptase Mutant (Y188L) Chain A gag-pol
Type:
Enzyme Subunit
Mol. Mass.:
64436.39
Organism:
Human immunodeficiency virus type 1
Description:
P04585[588-1147,Y776L]
Residue:
560
  
Component 2
Name:
Gag-Pol polyprotein [588-1027,Y776L]
Synonyms:
HIV-1 Reverse Transcriptase Mutant (Y188L) Chain B gag-pol
Type:
Enzyme Subunit
Mol. Mass.:
51287.11
Organism:
Human immunodeficiency virus type 1
Description:
P04585[588-1027,Y776L]
Residue:
440
  
Inhibitor
Name:
BDBM2483
Synonyms:
(4S)-6-chloro-4-(2-cyclopropylethynyl)-4-(trifluoromethyl)-2,4-dihydro-1H-3,1-benzoxazin-2-one DMP-266 Efavirenz L-743,726 | Sustiva
Type:
Small organic molecule
Emp. Form.:
C14H9ClF3NO2
Mol. Mass.:
315.675
SMILES:
FC(F)(F)[C@]1(OC(=O)Nc2ccc(Cl)cc12)C#CC1CC1
:
Substrate
Name:
poly(rA)/oligo(dT)
Synonyms:
Type:
RNA/DNA duplex
Mol. Mass.:
358.43
Organism:
Description:
[3H]-dTTP is co-substrate.
Residue:
3
NA