Target
Macrophage colony-stimulating factor 1 receptor
Ligand
BDBM27631
Substrate
Biotinylated substrate peptide
Meas. Tech.
Kinase Inhibition Assay
pH
7.5±n/a
Temperature
310.15±n/a K
IC50
9±n/a nM
Citation
 Burns, CJHarte, MFBu, XFantino, EGiarrusso, MJoffe, MKurek, MLegge, FSRazzino, PSu, STreutlein, HWan, SSZeng, JWilks, AF Discovery of 2-(alpha-methylbenzylamino) pyrazines as potent Type II inhibitors of FMS. Bioorg Med Chem Lett 19:1206-9 (2009)  
Target
Name:
Macrophage colony-stimulating factor 1 receptor
Synonyms:
CSF1R FMS Macrophage colony stimulating factor receptor Macrophage colony-stimulating factor 1 receptor (c-FMS) Proto-oncogene c-Fms c-fms | cFMS
Type:
Protein
Mol. Mass.:
107979.48
Organism:
Homo sapiens (Human)
Description:
P07333
Residue:
972
  
Inhibitor
Name:
BDBM27631
Synonyms:
3-chloro-N-{3-[(1S)-1-[(6-chloropyrazin-2-yl)amino]ethyl]phenyl}-4-fluorobenzamide | alpha-methylbenzylamino pyrazine deriv., 13
Type:
Small organic molecule
Emp. Form.:
C19H15Cl2FN4O
Mol. Mass.:
405.253
SMILES:
C[C@H](Nc1cncc(Cl)n1)c1cccc(NC(=O)c2ccc(F)c(Cl)c2)c1
:
Substrate
Name:
Biotinylated substrate peptide
Synonyms:
Type:
Peptide
Mol. Mass.:
2803.42
Organism:
Description:
Residue:
23