Target
Poly [ADP-ribose] polymerase 2
Ligand
BDBM27722
Substrate
BDBM27683
Meas. Tech.
PARP Enzyme Inhibition Assay
Temperature
298.15±n/a K
IC50
11±n/a nM
Comments
extracted
Citation
 Ishida, JYamamoto, HKido, YKamijo, KMurano, KMiyake, HOhkubo, MKinoshita, TWarizaya, MIwashita, AMihara, KMatsuoka, NHattori, K Discovery of potent and selective PARP-1 and PARP-2 inhibitors: SBDD analysis via a combination of X-ray structural study and homology modeling. Bioorg Med Chem 14:1378-90 (2006)  
Target
Name:
Poly [ADP-ribose] polymerase 2
Synonyms:
2.4.2.- ADP-ribosyltransferase diphtheria toxin-like 2 ARTD2 Adprtl2 DNA ADP-ribosyltransferase PARP2 PARP-2 Parp2 Poly [ADP-ribose] polymerase 2 (Parp2) Poly[ADP-ribose] synthase 2 Protein poly-ADP-ribosyltransferase PARP2 pADPRT-2 | poly-ADP-ribose polymerase 2 (PARP2)
Type:
Mol. Mass.:
63409.97
Organism:
Mus musculus (Mouse)
Description:
Alexis Biochemicals, Cat. no. ALX-201-064-C020
Residue:
559
  
Inhibitor
Name:
BDBM27722
Synonyms:
3-[4-(trifluoromethyl)phenyl]quinoxaline-5-carboxamide quinoxaline analogue, 3d
Type:
Small organic molecule
Emp. Form.:
C16H10F3N3O
Mol. Mass.:
317.2653
SMILES:
NC(=O)c1cccc2ncc(nc12)-c1ccc(cc1)C(F)(F)F
:
Substrate
Name:
BDBM27683
Synonyms:
[adenylate-32P]-NAD
Type:
radiolabeled substrate
Emp. Form.:
Mol. Mass.:
SMILES:
: