Target
Epidermal growth factor receptor [1-999,L858R]
Ligand
BDBM391742
Substrate
Meas. Tech.
Assay on In Vitro Enzyme-Inhibiting Activity
IC50
88.0±n/a nM
Citation
 Wu, F Tyrosine kinase inhibitor and uses thereof US Patent  US10300058 Publication Date 5/28/2019 
Target
Name:
Epidermal growth factor receptor [1-999,L858R]
Synonyms:
EGFR EGFR_HUMAN ERBB1 | HER1
Type:
Enzyme Catalytic Domain
Mol. Mass.:
111216.35
Organism:
Homo sapiens (Human)
Description:
P00533[1-999,L858R]
Residue:
999
  
Inhibitor
Name:
BDBM391742
Synonyms:
N-(3-((2-((2-methoxy-4-(1-(methylsulfonyl)piperidin-4-yl)phenyl)amino)-5-(trifluoromethyl)pyrimidin-4-yl)amino)phenyl)acrylamide | US10300058, Compound 27
Type:
Small organic molecule
Emp. Form.:
C27H29F3N6O4S
Mol. Mass.:
590.617
SMILES:
COc1cc(ccc1Nc1ncc(c(Nc2cccc(NC(=O)C=C)c2)n1)C(F)(F)F)C1CCN(CC1)S(C)(=O)=O
: