Target
Epidermal growth factor receptor [1-745,751-1210,T790M]
Ligand
BDBM391743
Substrate
Meas. Tech.
Assay on In Vitro Enzyme-Inhibiting Activity
IC50
0.800±n/a nM
Citation
 Wu, F Tyrosine kinase inhibitor and uses thereof US Patent  US10300058 Publication Date 5/28/2019 
Target
Name:
Epidermal growth factor receptor [1-745,751-1210,T790M]
Synonyms:
EGFR EGFR_HUMAN ERBB1 | HER1
Type:
Enzyme Catalytic Domain
Mol. Mass.:
133712.04
Organism:
Homo sapiens (Human)
Description:
P00533[1-745,751-1210,T790M]
Residue:
1205
  
Inhibitor
Name:
BDBM391743
Synonyms:
N-(3-((2-((2-methoxy-4-(4-morpholinopiperidin-1-yl)phenyl)amino)-5-(trifluoromethyl)pyrimidin-4-yl)amino)phenyl)acrylamide | US10300058, Compound 28
Type:
Small organic molecule
Emp. Form.:
C30H34F3N7O3
Mol. Mass.:
597.6313
SMILES:
COc1cc(ccc1Nc1ncc(c(Nc2cccc(NC(=O)C=C)c2)n1)C(F)(F)F)N1CCC(CC1)N1CCOCC1
: