Target
Peroxisome proliferator-activated receptor gamma
Ligand
BDBM28681
Substrate
BDBM10852
Meas. Tech.
Cell-Based Transcription Assay
EC50
82±n/a nM
Citation
 Oon Han, HKim, SHKim, KHHur, GCJoo Yim, HChung, HKHo Woo, SDong Koo, KLee, CSSung Koh, JKim, GT Design and synthesis of oxime ethers of alpha-acyl-beta-phenylpropanoic acids as PPAR dual agonists. Bioorg Med Chem Lett 17:937-41 (2007)  
Target
Name:
Peroxisome proliferator-activated receptor gamma
Synonyms:
NR1C3 PPAR-gamma PPARG_HUMAN Peroxisome proliferator-activated receptor gamma (PPAR gamma) Peroxisome proliferator-activated receptor gamma (PPARĪ³) peroxisome proliferator-activated receptor gamma isoform 2
Type:
Nuclear Receptor
Mol. Mass.:
57613.46
Organism:
Homo sapiens (Human)
Description:
P37231
Residue:
505
  
Inhibitor
Name:
BDBM28681
Synonyms:
5-[(4-{2-[methyl(pyridin-2-yl)amino]ethoxy}phenyl)methyl]-1,3-thiazolidine-2,4-dione BRL 49653 CHEMBL121 [3H]rosiglitazone rosiglitazone
Type:
radiolabeled ligand
Emp. Form.:
C18H19N3O3S
Mol. Mass.:
357.427
SMILES:
CN(CCOc1ccc(Cc2sc(=O)[nH]c2O)cc1)c1ccccn1
:
Substrate