Target
Dipeptidyl peptidase 1
Ligand
BDBM150619
Substrate
Meas. Tech.
Inhibition Assay of Human DPPI (Cathepsin C)
pH
6±n/a
Temperature
298.15±n/a K
IC50
1.30±n/a nM
Comments
extracted
Citation
 Anderskewitz, RBinder, FGrauert, MGrundl, MHaebel, PWOost, TPautsch, APeters, SVintonyak, V Methods for treating pulmonary emphysema using substituted 2-Aza-bicyclo[2.2.1]heptane-3-carboxylic acid (benzyl-cyano-methyl)-amides inhibitors of cathepsin C US Patent  US9713606 Publication Date 7/25/2017 
Target
Name:
Dipeptidyl peptidase 1
Synonyms:
CATC_HUMAN CTSC Cathepsin J Dipeptidyl peptidase 1 (DPPI) Dipeptidyl peptidase I (DPPI)
Type:
Enzyme
Mol. Mass.:
51857.28
Organism:
Homo sapiens (Human)
Description:
P53634
Residue:
463
  
Inhibitor
Name:
BDBM150619
Synonyms:
US10238633, Example 293 US9713606, 293
Type:
Small organic molecule
Emp. Form.:
C23H20F2N4O2
Mol. Mass.:
422.4273
SMILES:
Fc1ccc2c(c1)[nH]c(=O)c1cc(CC(NC(=O)[C@H]3N[C@@H]4CC[C@H]3C4)C#N)c(F)cc21
: