Target
Aromatase
Ligand
BDBM29222
Substrate
BDBM29231
Meas. Tech.
QR2 Assay and IC50 Value Determination
IC50
26800±n/a nM
Citation
 Maiti, AReddy, PVSturdy, MMarler, LPegan, SDMesecar, ADPezzuto, JMCushman, M Synthesis of casimiroin and optimization of its quinone reductase 2 and aromatase inhibitory activities. J Med Chem 52:1873-84 (2009)  
Target
Name:
Aromatase
Synonyms:
ARO1 CP19A_HUMAN CYP19 CYPXIX Cytochrome P450 19A1 Cytochrome P450-C19 (CYP19) FL cytokine receptor precursor | P-450AROM
Type:
Enzyme
Mol. Mass.:
57888.92
Organism:
Homo sapiens (Human)
Description:
P11511
Residue:
503
  
Inhibitor
Name:
BDBM29222
Synonyms:
casimiroin analogue, 1k
Type:
Small organic molecule
Emp. Form.:
C12H13NO3
Mol. Mass.:
219.2365
SMILES:
COc1ccc(OC)c2c(C)cc(=O)[nH]c12
:
Substrate
Name:
BDBM29231
Synonyms:
dibenzylfluorescein (DBF)
Type:
Emp. Form.:
Mol. Mass.:
SMILES:
: