Target
Cyclin-dependent kinase 4/G1/S-specific cyclin-D1
Ligand
BDBM395793
Substrate
Meas. Tech.
CDK Assay
IC50
<10±n/a nM
Citation
 Cheng, PCao, W Preparation and use of kinase inhibitor US Patent  US10308654 Publication Date 6/4/2019 
Target
Name:
Cyclin-dependent kinase 4/G1/S-specific cyclin-D1
Synonyms:
CDK4/CyclinD1 | cdk4
Type:
Protein
Mol. Mass.:
Description:
Components:
This complex has 2 components.
Component 1
Name:
Cyclin-dependent kinase 4
Synonyms:
CDK4 Cell division protein kinase 4 PSK-J3
Type:
Enzyme Subunit
Mol. Mass.:
33731.96
Organism:
Homo sapiens (Human)
Description:
P11802
Residue:
303
  
Component 2
Name:
G1/S-specific cyclin-D1
Synonyms:
CCND1_MOUSE Cyclin D1 | Cyl-1
Type:
Enzyme Subunit
Mol. Mass.:
33418.84
Organism:
Mus musculus (mouse)
Description:
Residue:
295
  
Inhibitor
Name:
BDBM395793
Synonyms:
US10308654, Example 21
Type:
Small organic molecule
Emp. Form.:
C26H35N9O
Mol. Mass.:
489.6158
SMILES:
CN1CCN(CC1)c1ccc(Nc2ncc3cc(C(=O)N4CCCC4)n(N4CCCCC4)c3n2)nc1
: