Target
TGF-beta receptor type-1 [T204D]
Ligand
BDBM396673
Substrate
Meas. Tech.
Biological Assay
IC50
1.000±n/a nM
Citation
 Ding, PGelman, MKinsella, TSingh, RBhamidipati, SVelaparthi, UBorzilleri, RMRahaman, HWarrier, JS GDF-8 inhibitors US Patent  US9981944 Publication Date 5/29/2018 
Target
Name:
TGF-beta receptor type-1 [T204D]
Synonyms:
ALK5 TGF-beta receptor type-1 (T204D) TGFBR1 TGFR-1 (T204D) | TGFR1_HUMAN
Type:
Mol. Mass.:
55981.22
Organism:
Homo sapiens (Human)
Description:
P36897[T204D]
Residue:
503
  
Inhibitor
Name:
BDBM396673
Synonyms:
6-(5'-fluoro-6'-methyl-[2,2'-bipyridin]-3- yl)imidazo[1,2-a]pyridine-3-carboxamide | US9981944, Example 19
Type:
Small organic molecule
Emp. Form.:
C19H14FN5O
Mol. Mass.:
347.3458
SMILES:
Cc1nc(ccc1F)-c1ncccc1-c1ccc2ncc(C(N)=O)n2c1
: