Target
TGF-beta receptor type-1 [T204D]
Ligand
BDBM396731
Substrate
Meas. Tech.
Biological Assay
IC50
4.00±n/a nM
Citation
 Ding, PGelman, MKinsella, TSingh, RBhamidipati, SVelaparthi, UBorzilleri, RMRahaman, HWarrier, JS GDF-8 inhibitors US Patent  US9981944 Publication Date 5/29/2018 
Target
Name:
TGF-beta receptor type-1 [T204D]
Synonyms:
ALK5 TGF-beta receptor type-1 (T204D) TGFBR1 TGFR-1 (T204D) | TGFR1_HUMAN
Type:
Mol. Mass.:
55981.22
Organism:
Homo sapiens (Human)
Description:
P36897[T204D]
Residue:
503
  
Inhibitor
Name:
BDBM396731
Synonyms:
N-(6-(5'-fluoro-6'-methyl-[2,2'-bipyridin]-3- yl)imidazo[1,2-a]pyridin-2-yl)acetamide | US9981944, Example 77
Type:
Small organic molecule
Emp. Form.:
C20H16FN5O
Mol. Mass.:
361.3723
SMILES:
CC(=O)Nc1cn2cc(ccc2n1)-c1cccnc1-c1ccc(F)c(C)n1
: