Target
TGF-beta receptor type-1 [T204D]
Ligand
BDBM396765
Substrate
Meas. Tech.
Biological Assay
IC50
2.00±n/a nM
Citation
 Ding, PGelman, MKinsella, TSingh, RBhamidipati, SVelaparthi, UBorzilleri, RMRahaman, HWarrier, JS GDF-8 inhibitors US Patent  US9981944 Publication Date 5/29/2018 
Target
Name:
TGF-beta receptor type-1 [T204D]
Synonyms:
ALK5 TGF-beta receptor type-1 (T204D) TGFBR1 TGFR-1 (T204D) | TGFR1_HUMAN
Type:
Mol. Mass.:
55981.22
Organism:
Homo sapiens (Human)
Description:
P36897[T204D]
Residue:
503
  
Inhibitor
Name:
BDBM396765
Synonyms:
6-(5'-fluoro-6'-methyl-[2,2'-bipyridin]-3- yl)imidazo[1,2-a]pyridine-2-carboxamide | US9981944, Example 110
Type:
Small organic molecule
Emp. Form.:
C19H14FN5
Mol. Mass.:
331.3464
SMILES:
Cc1nc(ccc1F)-c1ncccc1-c1ccc2ncnc(N)c2c1
: