Target
TGF-beta receptor type-1 [T204D]
Ligand
BDBM396767
Substrate
Meas. Tech.
Biological Assay
IC50
12.0±n/a nM
Citation
 Ding, PGelman, MKinsella, TSingh, RBhamidipati, SVelaparthi, UBorzilleri, RMRahaman, HWarrier, JS GDF-8 inhibitors US Patent  US9981944 Publication Date 5/29/2018 
Target
Name:
TGF-beta receptor type-1 [T204D]
Synonyms:
ALK5 TGF-beta receptor type-1 (T204D) TGFBR1 TGFR-1 (T204D) | TGFR1_HUMAN
Type:
Mol. Mass.:
55981.22
Organism:
Homo sapiens (Human)
Description:
P36897[T204D]
Residue:
503
  
Inhibitor
Name:
BDBM396767
Synonyms:
6-(5'-fluoro-6'-methyl-[2,2'-bipyridin]-3- yl)quinoxaline | US9981944, Example 112
Type:
Small organic molecule
Emp. Form.:
C19H13FN4
Mol. Mass.:
316.3317
SMILES:
Cc1nc(ccc1F)-c1ncccc1-c1ccc2nccnc2c1
: