Target
5-hydroxytryptamine receptor 1A
Ligand
BDBM30780
Substrate
Not Available
Meas. Tech.
Dose Response Assay for Agonists of 5-Hydroxytryptamine (Serotonin) Receptor Subtype 1A (5HT1A)
pH
7.4±n/a
Temperature
296.15±n/a K
EC50
99000±n/a nM
Citation
 PubChem, PC Dose Response Assay for 5-Hydroxytryptamine (Serotonin) Receptor Subtype 1a (5HT1a) Agonists PubChem Bioassay (2007)[AID] 
Target
Name:
5-hydroxytryptamine receptor 1A
Synonyms:
5-HT-1A 5-hydroxytryptamine receptor 1A (5-HT-1A) ADRB2RL1 Dopamine D2 receptor and serotonin 1a receptor HTR1A | Serotonin receptor 1A
Type:
Mol. Mass.:
46122.49
Organism:
Homo sapiens (Human)
Description:
Residue:
422
  
Inhibitor
Name:
BDBM30780
Synonyms:
(2S)-2-[(2,4-dimethylphenyl)carbamoylamino]-4-(methylthio)butyric acid (2S)-2-[(2,4-dimethylphenyl)carbamoylamino]-4-methylsulfanylbutanoic acid MLS000080863 cid_664998
Type:
Small organic molecule
Emp. Form.:
C14H20N2O3S
Mol. Mass.:
296.385
SMILES:
CSCC[C@H](NC(=O)Nc1ccc(C)cc1C)C(O)=O
:
Substrate
Name:
Not Available
Synonyms:
Type:
Mol. Mass.:
358.43
Organism:
Description:
Residue:
3
NA