Target
Gag-Pol polyprotein [588-1147,M628L,T656S,M771V,L797W,T802Y]
Ligand
BDBM77092
Substrate
Meas. Tech.
PHENOSENSE assay
IC50
9.0±0.0 nM
Citation
 Lanier, ER Methods of treating retroviral infections and related dosage regimes US Patent  US9694024 Publication Date 7/4/2017 
Target
Name:
Gag-Pol polyprotein [588-1147,M628L,T656S,M771V,L797W,T802Y]
Synonyms:
HIV RT (41L/210W/215Y/184V/69S) gag-pol
Type:
Mol. Mass.:
64557.40
Organism:
Human immunodeficiency virus type 1 group M subtype B (isolate HXB2)
Description:
P04585[588-1147,M628L,T656S,M771V,L797W,T802Y]
Residue:
560
  
Inhibitor
Name:
BDBM77092
Synonyms:
CMX-157 HDP-tenofovir hexadecyloxypropyl 9-(2-(phosphonomethoxy)propyl)adenine
Type:
Small organic molecule
Emp. Form.:
C28H52N5O5P
Mol. Mass.:
569.7167
SMILES:
(O)(=O)CO[C@H](C)Cn1cnc2c(N)ncnc12
: