Target
5-hydroxytryptamine receptor 1E
Ligand
BDBM31354
Substrate
Not Available
Meas. Tech.
Counterscreen assay for S1P3 antagonists: Dose response cell-based high throughput screening assay to identify antagonists of the 5-Hydroxytryptamine Receptor Subtype 1E (5HT1E)
pH
7.4±n/a
Temperature
296.15±n/a K
IC50
50000±n/a nM
Citation
 PubChem, PC Counterscreen assay for S1P3 antagonists: Dose response cell-based high throughput screening assay to identify antagonists of the 5-Hydroxytryptamine Receptor Subtype 1E (5HT1E) PubChem Bioassay (2009)[AID] 
Target
Name:
5-hydroxytryptamine receptor 1E
Synonyms:
5-HT-1E 5-Hydroxytryptamine Receptor Subtype 1E (5HT1E) 5-hydroxytryptamine receptor 1E (5-HT-1E) (S31) 5HT1E_HUMAN S31 Serotonin 1e (5-HT1e) receptor | Serotonin Receptor 1E
Type:
G Protein-Coupled Receptor (GPCR)
Mol. Mass.:
41697.80
Organism:
Homo sapiens (Human)
Description:
gi_112822
Residue:
365
  
Inhibitor
Name:
BDBM31354
Synonyms:
3-(4-methoxyphenyl)-1-(4-methylphenyl)-3-(4-nitroanilino)-1-propanone 3-(4-methoxyphenyl)-1-(4-methylphenyl)-3-[(4-nitrophenyl)amino]-1-propanone 3-(4-methoxyphenyl)-3-(4-nitroanilino)-1-(p-tolyl)propan-1-one SMR000201103 | cid_2971621
Type:
Small organic molecule
Emp. Form.:
C23H22N2O4
Mol. Mass.:
390.4318
SMILES:
COc1ccc(cc1)C(CC(=O)c1ccc(C)cc1)Nc1ccc(cc1)[N+]([O-])=O
:
Substrate
Name:
Not Available
Synonyms:
Type:
Mol. Mass.:
358.43
Organism:
Description:
Residue:
3
NA