Target
Carbonic anhydrase 5A, mitochondrial
Ligand
BDBM35736
Substrate
BDBM10856
Meas. Tech.
CA Inhibition Assay
Temperature
298.15±n/a K
Ki
8.3±n/a nM
Comments
extracted
Citation
 Güzel, OInnocenti, AScozzafava, ASalman, ASupuran, CT Carbonic anhydrase inhibitors. Aromatic/heterocyclic sulfonamides incorporating phenacetyl, pyridylacetyl and thienylacetyl tails act as potent inhibitors of human mitochondrial isoforms VA and VB. Bioorg Med Chem 17:4894-9 (2009)  
Target
Name:
Carbonic anhydrase 5A, mitochondrial
Synonyms:
CA-VA CA5A Carbonate dehydratase VA Carbonic anhydrase 5A (CA VA) Carbonic anhydrase 5A, mitochondrial precursor Carbonic anhydrase VA (CA VA)
Type:
Enzyme
Mol. Mass.:
34755.54
Organism:
Homo sapiens (Human)
Description:
Human (cloned) isozyme
Residue:
305
  
Inhibitor
Name:
BDBM35736
Synonyms:
sulfonamide deriv., 7d
Type:
Small organic molecule
Emp. Form.:
C14H13FN2O3S
Mol. Mass.:
308.328
SMILES:
NS(=O)(=O)c1ccc(NC(=O)Cc2ccccc2)c(F)c1
:
Substrate
Name:
BDBM10856
Synonyms:
Carbon Dioxide | methanedione
Type:
Small organic molecule
Emp. Form.:
CO2
Mol. Mass.:
44.0095
SMILES:
O=C=O
: