Target
Beta-mannosidase
Ligand
BDBM50182801
Substrate
Meas. Tech.
Btman2A
pH
5.6±0
Temperature
310.15±0 K
Ki
9000000±0.0 nM
Citation
 Tailford, LEOffen, WASmith, NLDumon, CMorland, CGratien, JHeck, MPStick, RVBlériot, YVasella, AGilbert, HJDavies, GJ Structural and biochemical evidence for a boat-like transition state in beta-mannosidases. Nat Chem Biol 4:306-12 (2008)  
Target
Name:
Beta-mannosidase
Synonyms:
Type:
Protien
Mol. Mass.:
99501.54
Organism:
Bacteroides thetaiotaomicron
Description:
Q8AAK6
Residue:
864
  
Inhibitor
Name:
BDBM50182801
Synonyms:
(3R,4R,5R)-5-(Hydroxymethyl)piperidine-3,4-diol, 8 5-HYDROXYMETHYL-3,4-DIHYDROXYPIPERIDINE CHEMBL206468 US10081601, Example 1.1 isofagomine
Type:
Small organic molecule
Emp. Form.:
C6H13NO3
Mol. Mass.:
147.1723
SMILES:
OC[C@H]1CNC[C@@H](O)[C@@H]1O
: