Target
Thyroid hormone receptor beta
Ligand
BDBM18860
Substrate
Meas. Tech.
Competition Binding Assay
Kd
0.081±0 nM
Citation
 Ocasio, CAScanlan, TS Design and characterization of a thyroid hormone receptor alpha (TRalpha)-specific agonist. ACS Chem Biol 1:585-93 (2006)  
Target
Name:
Thyroid hormone receptor beta
Synonyms:
ERBA2 Nuclear receptor subfamily 1 group A member 2 THR1 c-erbA-2 | c-erbA-beta
Type:
Receptor
Mol. Mass.:
52793.62
Organism:
Homo sapiens (Human)
Description:
Recombinant hThR was obtained from nuclear extracts from SF9 cells infected with baculovirus vectors encoding for ThRbeta 1.
Residue:
461
  
Inhibitor
Name:
BDBM18860
Synonyms:
(2R)-2-amino-3-[4-(4-hydroxy-3-iodophenoxy)-3,5-diiodophenyl]propanoic acid 3,5,3'-triiodo-L-thyronine (T3) Triiodothyronine US10544075, Compound T3 liothyronine | triothyrone
Type:
Hormone
Emp. Form.:
C15H12I3NO4
Mol. Mass.:
650.9735
SMILES:
N[C@@H](Cc1cc(I)c(Oc2ccc(O)c(I)c2)c(I)c1)C(O)=O
: