Target
Epidermal growth factor receptor [1-999,L858R]
Ligand
BDBM13336
Substrate
Meas. Tech.
Kinase Inhibitor Selectivity Profiling Assay
Kd
1900000±n/a nM
Citation
 PubChem, PC Kinase Inhibitor Selectivity Profiling Assay PubChem Bioassay (2008)[AID] 
Target
Name:
Epidermal growth factor receptor [1-999,L858R]
Synonyms:
EGFR EGFR_HUMAN ERBB1 | HER1
Type:
Enzyme Catalytic Domain
Mol. Mass.:
111216.35
Organism:
Homo sapiens (Human)
Description:
P00533[1-999,L858R]
Residue:
999
  
Inhibitor
Name:
BDBM13336
Synonyms:
4-[4-(4-fluorophenyl)-2-(4-methanesulfinylphenyl)-1H-imidazol-5-yl]pyridine 4-{4-(4-fluorophenyl)-2-[4-(methylsulfinyl)phenyl]-1H-imidazol-5-yl}pyridine SB-203580 cid_176155
Type:
Small organic molecule
Emp. Form.:
C21H16FN3OS
Mol. Mass.:
377.435
SMILES:
CS(=O)c1ccc(cc1)-c1nc(c([nH]1)-c1ccc(F)cc1)-c1ccncc1
: