Target
Fibroblast growth factor receptor 4
Ligand
BDBM89510
Substrate
Meas. Tech.
Omnia Assay
pH
7.5±n/a
IC50
<100±n/a nM
Comments
extracted
Citation
 D'Agostino, LASjin, RTNiu, DMcDonald, JJZhu, ZLiu, HMazdiyasni, HPetter, RCSingh, JBarrague, MGross, AMunson, M Heteroaryl compounds and uses thereof US Patent  US9695132 Publication Date 7/4/2017 
Target
Name:
Fibroblast growth factor receptor 4
Synonyms:
CD_antigen: CD334 FGFR4 FGFR4 Fibroblast growth factor receptor JK2 TKF
Type:
Protein
Mol. Mass.:
87957.45
Organism:
Homo sapiens (Human)
Description:
P22455
Residue:
802
  
Inhibitor
Name:
BDBM89510
Synonyms:
US10189794, Compound I-50 US10774052, Compound I-50 | US9695132, I-50
Type:
Small organic molecule
Emp. Form.:
C25H23F3N6O4
Mol. Mass.:
528.4831
SMILES:
COc1cc(OC)cc(c1)N1Cc2cnc(Nc3cc(ccc3NC(=O)C=C)C(F)(F)F)nc2N(C)C1=O
: