Target
Fibroblast growth factor receptor 4
Ligand
BDBM91649
Substrate
Meas. Tech.
Omnia Assay
pH
7.5±n/a
IC50
<100±n/a nM
Comments
extracted
Citation
 D'Agostino, LASjin, RTNiu, DMcDonald, JJZhu, ZLiu, HMazdiyasni, HPetter, RCSingh, JBarrague, MGross, AMunson, M Heteroaryl compounds and uses thereof US Patent  US9695132 Publication Date 7/4/2017 
Target
Name:
Fibroblast growth factor receptor 4
Synonyms:
CD_antigen: CD334 FGFR4 FGFR4 Fibroblast growth factor receptor JK2 TKF
Type:
Protein
Mol. Mass.:
87957.45
Organism:
Homo sapiens (Human)
Description:
P22455
Residue:
802
  
Inhibitor
Name:
BDBM91649
Synonyms:
US10189794, Compound I-55 US10774052, Compound I-55 | US9695132, I-55
Type:
Small organic molecule
Emp. Form.:
C32H36N6O5
Mol. Mass.:
584.6654
SMILES:
COc1cc(OC)cc(c1)N1Cc2ccc(Nc3ccc(cc3NC(=O)C=C)N3CCN(CC3)C(C)=O)cc2N(C)C1=O
: