Target
Gag-Pol polyprotein [600-1027,Y780C]/[600-1155,Y780C]
Ligand
BDBM1434
Substrate
poly(rC):oligo(dG)
Meas. Tech.
HIV-1 RT Assay
pH
7.8±n/a
Temperature
298.15±n/a K
IC50
2600±n/a nM
Citation
 Proudfoot, JRHargrave, KDKapadia, SRPatel, URGrozinger, KGMcNeil, DWCullen, ECardozo, MTong, LKelly, TA Novel non-nucleoside inhibitors of human immunodeficiency virus type 1 (HIV-1) reverse transcriptase. 4. 2-Substituted dipyridodiazepinones as potent inhibitors of both wild-type and cysteine-181 HIV-1 reverse transcriptase enzymes. J Med Chem 38:4830-8 (1995)  
Target
Name:
Gag-Pol polyprotein [600-1027,Y780C]/[600-1155,Y780C]
Synonyms:
EC: 2.7.7.49 | HIV-1 Reverse Transcriptase Mutant (Y181C)
Type:
Protein Complex
Mol. Mass.:
115564
Description:
Components:
This complex has 2 components.
Component 1
Name:
Gag-Pol polyprotein [600-1155,Y780C]
Synonyms:
HIV-1 Reverse Transcriptase Mutant (Y181C) Chain A gag-pol
Type:
Enzyme Subunit
Mol. Mass.:
63868.77
Organism:
Human immunodeficiency virus type 1
Description:
P03366[600-1155,Y780C]
Residue:
556
  
Component 2
Name:
Gag-Pol polyprotein [600-1027,Y780C]
Synonyms:
HIV-1 Reverse Transcriptase Mutant (Y181C) Chain B gag-pol
Type:
Enzyme Subunit
Mol. Mass.:
49908.60
Organism:
Human immunodeficiency virus type 1
Description:
P03366[600-1027,Y780C]
Residue:
428
  
Inhibitor
Name:
BDBM1434
Synonyms:
11-cyclopropyl-5,11-dihydro-4-methyl-6H-dipyrido[3,2-b:2 ,3 -e][1,4]diazepin-6-one BI-RG-587 Nevirapine US11420959, Example NVP | Viramune
Type:
Small organic molecule
Emp. Form.:
C15H14N4O
Mol. Mass.:
266.2979
SMILES:
Cc1ccnc2N(C3CC3)c3ncccc3C(=O)Nc12
:
Substrate
Name:
poly(rC):oligo(dG)
Synonyms:
Type:
RNA-DNA duplex
Mol. Mass.:
358.43
Organism:
Description:
The incorporation of Tritium-labeled [3H]dGTP onto a (poly)rC:(oligo)dG template:primer.
Residue:
3
NA