Target
fMet-Leu-Phe receptor
Ligand
BDBM37700
Substrate
Meas. Tech.
Dose Response Assay for Formylpeptide Receptor (FPR) Ligands and Dose Response Counter-Screen Assay for Formylpeptide-Like-1 (FPRL1) Ligands
IC50
>66700±n/a nM
Citation
 PubChem, PC Dose Response Assay for Formylpeptide Receptor (FPR) Ligands and Dose Response Counter-Screen Assay for Formylpeptide-Like-1 (FPRL1) Ligands PubChem Bioassay (2007)[AID] 
Target
Name:
fMet-Leu-Phe receptor
Synonyms:
FPR FPR1_HUMAN N-formyl peptide receptor 1 fMLP receptor formyl peptide receptor 1
Type:
Enzyme Catalytic Domain
Mol. Mass.:
38456.14
Organism:
Homo sapiens (Human)
Description:
gi_4503779
Residue:
350
  
Inhibitor
Name:
BDBM37700
Synonyms:
3-(4-fluorobenzyl)-6-indolin-1-yl-uracil MLS000045863 cid_3237685
Type:
Small organic molecule
Emp. Form.:
C19H16FN3O2
Mol. Mass.:
337.3476
SMILES:
Fc1ccc(Cn2c(=O)cc([nH]c2=O)N2CCc3ccccc23)cc1
: