Target
N-formyl peptide receptor 2
Ligand
BDBM34503
Substrate
Meas. Tech.
Dose Response Assay for Formylpeptide Receptor-Like-1 (FPRL1) Ligands and Dose Response Counter-Screen Assay for Formylpeptide Receptor (FPR) Ligands
Ki
>40300±n/a nM
Comments
Extracted from aid = 520 and tid = 2
Citation
 PubChem, PC Dose Response Assay for Formylpeptide Receptor-Like-1 (FPRL1) Ligands and Dose Response Counter-Screen Assay for Formylpeptide Receptor (FPR) Ligands PubChem Bioassay (2007)[AID] 
Target
Name:
N-formyl peptide receptor 2
Synonyms:
ALXR, FPRL1, FPR2 FPR2 FPRH1 Formyl Peptide Receptor-Like 1 LXA4 receptor Lipoxin A4 receptor RFP | hFPRL
Type:
G Protein-Coupled Receptor (GPCR)
Mol. Mass.:
38968.35
Organism:
Homo sapiens (Human)
Description:
P25090
Residue:
351
  
Inhibitor
Name:
BDBM34503
Synonyms:
3-cyclohexyl-6-keto-8-(2-methoxy-1-naphthyl)-2,4,7,8-tetrahydropyrido[2,1-b][1,3,5]thiadiazine-9-carbonitrile 3-cyclohexyl-8-(2-methoxynaphthalen-1-yl)-6-oxidanylidene-2,4,7,8-tetrahydropyrido[2,1-b][1,3,5]thiadiazine-9-carbonitrile MLS000117271 cid_5307697
Type:
Small organic molecule
Emp. Form.:
C25H27N3O2S
Mol. Mass.:
433.566
SMILES:
COc1ccc2ccccc2c1C1CC(=O)N2CN(CSC2=C1C#N)C1CCCCC1
: