Target
Isoform 2 of Nuclear receptor ROR-alpha (Alpha-2)
Ligand
BDBM38993
Substrate
Meas. Tech.
Counterscreen for inhibitors of the nuclear receptor Steroidogenic Factor 1 (SF-1): A cell-based dose-response assay for inhibition of the RAR-related orphan receptor A (RORA)
IC50
1782±n/a nM
Citation
 PubChem, PC Counterscreen for inhibitors of the nuclear receptor Steroidogenic Factor 1 (SF-1): A cell-based dose-response assay for inhibition of the RAR-related orphan receptor A (RORA) PubChem Bioassay (2007)[AID] 
Target
Name:
Isoform 2 of Nuclear receptor ROR-alpha (Alpha-2)
Synonyms:
NR1F1 Nuclear receptor ROR-alpha (Alpha-2) RORA RZRA
Type:
PROTEIN
Mol. Mass.:
63033.59
Organism:
Homo sapiens (Human)
Description:
EBI_101591
Residue:
556
  
Inhibitor
Name:
BDBM38993
Synonyms:
(1Z,3Z)-1,4-bis(butylsulfonyl)buta-1,3-diene SMR000020833 | cid_5286934
Type:
Small organic molecule
Emp. Form.:
C12H22O4S2
Mol. Mass.:
294.431
SMILES:
CCCCS(=O)(=O)\C=C/C=C\S(=O)(=O)CCCC
: