Target
Steroidogenic factor 1
Ligand
BDBM38923
Substrate
Meas. Tech.
Counterscreen for inhibitors of the Retinoic Acid Receptor-related orphan receptor A (RORA): A cell-based dose-response assay for inhibition of the Steroidogenic Factor 1 (SF-1)
IC50
5177±n/a nM
Citation
 PubChem, PC Counterscreen for inhibitors of the Retinoic Acid Receptor-related orphan receptor A (RORA): A cell-based dose-response assay for inhibition of the Steroidogenic Factor 1 (SF-1) PubChem Bioassay (2007)[AID] 
Target
Name:
Steroidogenic factor 1
Synonyms:
AD4BP FTZF1 NR5A1 SF-1 STF-1 Steroid hormone receptor Ad4BP
Type:
Nuclear Hormone Receptor
Mol. Mass.:
51643.43
Organism:
Homo sapiens (Human)
Description:
Residue:
461
  
Inhibitor
Name:
BDBM38923
Synonyms:
(2-oxidanylideneoxolan-3-yl) 5-(1,3-benzothiazol-2-yl)thiophene-2-carboxylate 5-(1,3-benzothiazol-2-yl)-2-thiophenecarboxylic acid (2-oxo-3-oxolanyl) ester MLS000096514 cid_2997660
Type:
Small organic molecule
Emp. Form.:
C16H11NO4S2
Mol. Mass.:
345.393
SMILES:
O=C(OC1CCOC1=O)c1ccc(s1)-c1nc2ccccc2s1
: