Target
Beta-lactamase
Ligand
BDBM50115616
Substrate
Meas. Tech.
Inhibition Assay
pH
7±0
Ki
6e+3±n/a nM
Citation
 Tondi, DPowers, RACaselli, ENegri, MCBlázquez, JCosti, MPShoichet, BK Structure-based design and in-parallel synthesis of inhibitors of AmpC beta-lactamase. Chem Biol 8:593-611 (2001)  
Target
Name:
Beta-lactamase
Synonyms:
AMPC_ENTCL | ampC
Type:
PROTEIN
Mol. Mass.:
41306.67
Organism:
Enterobacter cloacae
Description:
ChEMBL_40258
Residue:
381
  
Inhibitor
Name:
BDBM50115616
Synonyms:
3-(4-BENZENESULFONYL-THIOPHENE-2-SULFONYLAMINO)-PHENYLBORONIC ACID Amide and sulfonamide derivatives, 2 CHEMBL113381
Type:
Small organic molecule
Emp. Form.:
C16H14BNO6S3
Mol. Mass.:
423.291
SMILES:
OB(O)c1cccc(NS(=O)(=O)c2cc(cs2)S(=O)(=O)c2ccccc2)c1
: