Target
fMet-Leu-Phe receptor
Ligand
BDBM40416
Substrate
Meas. Tech.
Formylpeptide Receptor (FPR) Ligand Structure Activity Relationship (SAR) Analysis : Dose Response Assay
Ki
1100±n/a nM
Citation
 PubChem, PC Formylpeptide Receptor (FPR) Ligand Structure Activity Relationship (SAR) Analysis : Dose Response Assay PubChem Bioassay (2007)[AID] 
Target
Name:
fMet-Leu-Phe receptor
Synonyms:
FPR FPR1_HUMAN N-formyl peptide receptor 1 fMLP receptor formyl peptide receptor 1
Type:
Enzyme Catalytic Domain
Mol. Mass.:
38456.14
Organism:
Homo sapiens (Human)
Description:
gi_4503779
Residue:
350
  
Inhibitor
Name:
BDBM40416
Synonyms:
2-thiophenecarboxylic acid [3-(2-chlorophenyl)-4-oxo-2-(trifluoromethyl)-1-benzopyran-7-yl] ester [3-(2-chlorophenyl)-4-oxidanylidene-2-(trifluoromethyl)chromen-7-yl] thiophene-2-carboxylate cid_1561677 | thiophene-2-carboxylic acid [3-(2-chlorophenyl)-4-keto-2-(trifluoromethyl)chromen-7-yl] ester
Type:
Small organic molecule
Emp. Form.:
C21H10ClF3O4S
Mol. Mass.:
450.815
SMILES:
FC(F)(F)c1oc2cc(OC(=O)c3cccs3)ccc2c(=O)c1-c1ccccc1Cl
: