Target
Estrogen receptor
Ligand
BDBM42034
Substrate
Meas. Tech.
Estrogen Receptor (alpha) binding: Dose Response of Primary Screen Assay
EC50
557.4±n/a nM
Citation
 PubChem, PC Estrogen Receptor (alpha) binding: Dose Response of Primary Screen Assay PubChem Bioassay (2008)[AID] 
Target
Name:
Estrogen receptor
Synonyms:
ER ESR ESR1_HUMAN Estrogen receptor Estrogen receptor (ER-alpha) Estrogen receptor alpha (ER) Nuclear receptor subfamily 3 group A member 1
Type:
Protein
Mol. Mass.:
66230.44
Organism:
Homo sapiens (Human)
Description:
P03372
Residue:
595
  
Inhibitor
Name:
BDBM42034
Synonyms:
4-(3-nitro-4-oxidanyl-phenyl)-3a,4,5,9b-tetrahydro-3H-cyclopenta[c]quinoline-6-carboxylic acid 4-(4-hydroxy-3-nitrophenyl)-3a,4,5,9b-tetrahydro-3H-cyclopenta[c]quinoline-6-carboxylic acid cid_4182169
Type:
Small organic molecule
Emp. Form.:
C19H16N2O5
Mol. Mass.:
352.3407
SMILES:
OC(=O)c1cccc2C3C=CCC3C(Nc12)c1ccc(O)c(c1)[N+]([O-])=O
: