Target
Galanin receptor type 2
Ligand
BDBM41951
Substrate
Meas. Tech.
Dose response counterscreen for agonists of galanin receptor 2 (GalR2): a cell-based high-throughput screening assay for activators of beta-lactamase activity
EC50
>55700±n/a nM
Citation
 PubChem, PC Dose response counterscreen for agonists of galanin receptor 2 (GalR2): a cell-based high-throughput screening assay for activators of beta-lactamase activity PubChem Bioassay (2008)[AID] 
Target
Name:
Galanin receptor type 2
Synonyms:
GALNR2 GALR2_HUMAN Galanin receptor 2 Galanin receptor type 2 (GAL2-R) (GALR2).
Type:
Enzyme Catalytic Domain
Mol. Mass.:
41724.40
Organism:
Homo sapiens (Human)
Description:
Galanin R2 GALR2 HUMAN::O43603
Residue:
387
  
Inhibitor
Name:
BDBM41951
Synonyms:
MLS000696629 N'-(4,6-dimethyl-1,3-benzothiazol-2-yl)-4-(3,5-dimethylpiperidin-1-yl)sulfonylbenzohydrazide N'-(4,6-dimethyl-1,3-benzothiazol-2-yl)-4-[(3,5-dimethyl-1-piperidinyl)sulfonyl]benzohydrazide cid_12006126
Type:
Small organic molecule
Emp. Form.:
C23H28N4O3S2
Mol. Mass.:
472.623
SMILES:
CC1CC(C)CN(C1)S(=O)(=O)c1ccc(cc1)C(=O)NNc1nc2c(C)cc(C)cc2s1
: