Target
Neuropeptide Y receptor type 2
Ligand
BDBM36851
Substrate
Meas. Tech.
Dose response counterscreen assay for neuropeptide Y receptor Y1 (NPY-Y1): Cell-based high throughput assay to measure NPY-Y2 antagonism
IC50
7737±n/a nM
Citation
 PubChem, PC Dose response counterscreen assay for neuropeptide Y receptor Y1 (NPY-Y1): Cell-based high throughput assay to measure NPY-Y2 antagonism PubChem Bioassay (2008)[AID] 
Target
Name:
Neuropeptide Y receptor type 2
Synonyms:
NPY-Y2 NPY2-R NPY2R_HUMAN Y2 receptor | neuropeptide Y receptor Y2
Type:
Enzyme Catalytic Domain
Mol. Mass.:
42734.65
Organism:
Homo sapiens (Human)
Description:
NPY-Y2 NPY2R HUMAN::P49146
Residue:
381
  
Inhibitor
Name:
BDBM36851
Synonyms:
MLS000072751 N-[5-(1-benzotriazolylmethyl)-1,3,4-thiadiazol-2-yl]-4-tert-butyl-N-ethylbenzamide N-[5-(benzotriazol-1-ylmethyl)-1,3,4-thiadiazol-2-yl]-4-tert-butyl-N-ethylbenzamide cid_649706
Type:
Small organic molecule
Emp. Form.:
C22H24N6OS
Mol. Mass.:
420.531
SMILES:
CCN(C(=O)c1ccc(cc1)C(C)(C)C)c1nnc(Cn2nnc3ccccc23)s1
: