Target
Neuropeptide Y receptor type 2
Ligand
BDBM42420
Substrate
Meas. Tech.
Dose response counterscreen assay for neuropeptide Y receptor Y1 (NPY-Y1): Cell-based high throughput assay to measure NPY-Y2 antagonism
IC50
10810±n/a nM
Citation
 PubChem, PC Dose response counterscreen assay for neuropeptide Y receptor Y1 (NPY-Y1): Cell-based high throughput assay to measure NPY-Y2 antagonism PubChem Bioassay (2008)[AID] 
Target
Name:
Neuropeptide Y receptor type 2
Synonyms:
NPY-Y2 NPY2-R NPY2R_HUMAN Y2 receptor | neuropeptide Y receptor Y2
Type:
Enzyme Catalytic Domain
Mol. Mass.:
42734.65
Organism:
Homo sapiens (Human)
Description:
NPY-Y2 NPY2R HUMAN::P49146
Residue:
381
  
Inhibitor
Name:
BDBM42420
Synonyms:
3-(2-chloro-6-fluoro-benzyl)oxy-1-[3-chloro-5-(trifluoromethyl)-2-pyridyl]-2-methyl-4-pyridone 3-[(2-chloro-6-fluorobenzyl)oxy]-1-[3-chloro-5-(trifluoromethyl)-2-pyridinyl]-2-methyl-4(1H)-pyridinone 3-[(2-chloro-6-fluorophenyl)methoxy]-1-[3-chloro-5-(trifluoromethyl)pyridin-2-yl]-2-methylpyridin-4-one SMR000125396 | cid_1490113
Type:
Small organic molecule
Emp. Form.:
C19H12Cl2F4N2O2
Mol. Mass.:
447.21
SMILES:
Cc1c(OCc2c(F)cccc2Cl)c(=O)ccn1-c1ncc(cc1Cl)C(F)(F)F
: