Target
Neuropeptide Y receptor type 2
Ligand
BDBM42423
Substrate
Meas. Tech.
Dose response counterscreen assay for neuropeptide Y receptor Y1 (NPY-Y1): Cell-based high throughput assay to measure NPY-Y2 antagonism
IC50
9223±n/a nM
Citation
 PubChem, PC Dose response counterscreen assay for neuropeptide Y receptor Y1 (NPY-Y1): Cell-based high throughput assay to measure NPY-Y2 antagonism PubChem Bioassay (2008)[AID] 
Target
Name:
Neuropeptide Y receptor type 2
Synonyms:
NPY-Y2 NPY2-R NPY2R_HUMAN Y2 receptor | neuropeptide Y receptor Y2
Type:
Enzyme Catalytic Domain
Mol. Mass.:
42734.65
Organism:
Homo sapiens (Human)
Description:
NPY-Y2 NPY2R HUMAN::P49146
Residue:
381
  
Inhibitor
Name:
BDBM42423
Synonyms:
MLS000519450 [1-(4-chlorobenzyl)indol-3-yl]-(2-furyl)methanone [1-[(4-chlorophenyl)methyl]indol-3-yl]-(furan-2-yl)methanone | cid_955150
Type:
Small organic molecule
Emp. Form.:
C20H14ClNO2
Mol. Mass.:
335.784
SMILES:
Clc1ccc(Cn2cc(C(=O)c3ccco3)c3ccccc23)cc1
: