Target
Neuropeptide Y receptor type 2
Ligand
BDBM42046
Substrate
Meas. Tech.
Dose response counterscreen assay for neuropeptide Y receptor Y1 (NPY-Y1): Cell-based high throughput assay to measure NPY-Y2 antagonism
IC50
>35000±n/a nM
Citation
 PubChem, PC Dose response counterscreen assay for neuropeptide Y receptor Y1 (NPY-Y1): Cell-based high throughput assay to measure NPY-Y2 antagonism PubChem Bioassay (2008)[AID] 
Target
Name:
Neuropeptide Y receptor type 2
Synonyms:
NPY-Y2 NPY2-R NPY2R_HUMAN Y2 receptor | neuropeptide Y receptor Y2
Type:
Enzyme Catalytic Domain
Mol. Mass.:
42734.65
Organism:
Homo sapiens (Human)
Description:
NPY-Y2 NPY2R HUMAN::P49146
Residue:
381
  
Inhibitor
Name:
BDBM42046
Synonyms:
2-(1H-benzimidazol-2-ylsulfanyl)-1-[2,5-dimethyl-1-(oxolan-2-ylmethyl)pyrrol-3-yl]ethanone 2-(1H-benzimidazol-2-ylthio)-1-[2,5-dimethyl-1-(tetrahydrofurfuryl)pyrrol-3-yl]ethanone SMR000152774 | cid_3918052
Type:
Small organic molecule
Emp. Form.:
C20H23N3O2S
Mol. Mass.:
369.481
SMILES:
Cc1cc(C(=O)CSc2nc3ccccc3[nH]2)c(C)n1CC1CCCO1
: